{"text_format":"1","workbook":"xlsx","n_sheets":7,"sheets":["Scoresheet","References","Guidance","LocationList","Color Legend","Dropdowns","NA_Justification"],"not_rendered":{"charts":0,"images":6,"macros":1,"external_links":0,"defined_names":124,"comments":0,"pivot_tables":0},"unopened":[],"bounds":{"document_bytes":16777216,"sheet_cells":100000,"rows_first":2000,"rows_last":500,"rows_between":2000,"halvings":0,"cell_chars":16384,"cell_head_chars":4096},"cells_cut":0,"cells_raw":0,"read":"whole","date_system":"1900"}

{"sheet":"Scoresheet","index":0,"n_rows":334,"n_cols":13,"rows_kept":334,"cut":false,"hidden":false,"merged":[[11,0,11,1],[42,0,42,2],[221,3,221,4],[220,3,220,4],[214,3,214,4],[207,3,207,4],[197,3,197,4],[198,3,198,4],[199,3,199,4],[145,3,145,4],[108,3,108,4],[143,3,143,4],[144,3,144,4],[130,0,130,5],[165,3,165,4],[139,3,139,4],[141,3,141,4],[154,3,154,4],[146,3,146,4],[147,3,147,4],[142,3,142,4],[240,3,240,4],[236,3,236,4],[237,3,237,4],[234,3,234,4],[235,3,235,4],[238,3,238,4],[239,3,239,4],[12,0,18,1],[226,3,226,4],[232,3,232,4],[233,3,233,4],[228,3,228,4],[229,3,229,4],[230,3,230,4],[231,3,231,4],[227,3,227,4],[43,0,43,1],[44,0,44,1],[196,3,196,4],[137,3,137,4],[138,3,138,4],[140,3,140,4],[158,3,158,4]]}
["Air Force MILCON Sustainability Requirements Scoresheet"]
["version LEED® 2009 (Updated September 2013)",null,null,null,null,"* required entry"]
["General Information",null,null,null,{"$f":"IF(OR(COUNTBLANK(D4:D13)>0,COUNTBLANK(D15:D19)>0,COUNTBLANK(D39)>0,F20=\"*\"),\"INCOMPLETE\",\"\")","v":"INCOMPLETE"}]
[null,null,null,null,"Project ID (e.g. ABCD12345)",{"$f":"IF(ISBLANK(D4),\"*\",\"\")","v":"*"},null,null,null,null,"SurveyData"]
[null,null,null,null,"Real Property Unique ID (RPUID)",{"$f":"IF(ISBLANK(D5),\"*\",\"\")","v":"*"},null,null,null,null,"SurveyData"]
[null,null,null,null,"Building Name",{"$f":"IF(ISBLANK(D6),\"*\",\"\")","v":"*"},null,null,null,null,"SurveyData"]
[null,null,null,null,"Project Type",{"$f":"IF(ISBLANK(D7),\"*\",\"\")","v":"*"},null,null,null,null,"SurveyData"]
[null,null,null,null,"Installation",{"$f":"IF(ISBLANK(D8),\"*\",\"\")","v":"*"},null,null,null,null,"SurveyData"]
[null,null,null,{"$f":"IF(ISERROR(VLOOKUP(D8,LocationList!B4:E90,2,FALSE)),\"\",VLOOKUP(D8,LocationList!B4:E90,2,FALSE))","v":""},"City","*",null,null,null,null,"SurveyData"]
[null,null,null,{"$f":"IF(ISERROR(VLOOKUP(D8,LocationList!B4:E90,3,FALSE)),\"\",VLOOKUP(D8,LocationList!B4:E90,3,FALSE))","v":""},"State","*",null,null,null,null,"SurveyData"]
[null,null,null,{"$f":"IF(ISERROR(VLOOKUP(D8,LocationList!B4:E90,4,FALSE)),\"\",VLOOKUP(D8,LocationList!B4:E90,4,FALSE))","v":""},"CONUS","*",null,null,null,null,"SurveyData"]
[{"$f":"IF(COUNTIF(NA_Justification!E5:E38,\"No\")>0,\"Please complete NA justifications\",\"\")","v":""},null,null,null,"MAJCOM",{"$f":"IF(ISBLANK(D12),\"*\",\"\")","v":"*"},null,null,null,null,"SurveyData"]
[{"$f":"IF(COUNTBLANK(Dropdowns!B37:B43)=7,\"Federal Requirements Complete\",\"SURVEY INCOMPLETE\")","v":"SURVEY INCOMPLETE"},null,null,null,"PM Name","*",null,null,null,null,"SurveyData"]
[null,null,null,null,"PA ($k)","*",null,null,null,null,"SurveyData"]
[null,null,null,null,"Building Size (SF)","*",null,null,null,null,"SurveyData"]
[null,null,null,null,"Program Year (FY####)","*",null,null,null,null,"SurveyData"]
[null,null,null,null,"Project Phase","*",null,null,null,null,"SurveyData"]
[null,null,null,null,"Design Started (FY####)","*",null,null,null,null,"SurveyData"]
[null,null,null,null,"BOD (MM/DD/YY)","*",null,null,null,null,"SurveyData"]
["revision",null,null,null,"Pursuing formal LEED® Certification",{"$f":"IF(AND(D20=\"Complete\",D37=\"Complete\"),\"\",IF(OR(D20=\"Not in pursuit of LEED\",D20=\"In Progress\"),\"\",\"*\"))","v":"*"},null,null,null,null,"SurveyData"]
{"$rows_left_out":315}
{"sheet":"References","index":1,"n_rows":60,"n_cols":2,"rows_kept":60,"cut":false,"hidden":true,"merged":[[1,0,1,1],[0,0,0,1]]}
["Additional References to ASHRAE 189.1 and UFC Requirements"]
["This summary includes additional detail on ASHRAE 189.1 and the UFC but is not a replacement or substitute to using ASHRAE 189.1."]
["UFC Reference","UFC and ASHRAE Summary"]
["HPSB I: Employ Integrated Design Principles"]
["1-200-02, 2-2.1 - Integrated Design","Evaluate the site and building components to determine whether passive and natural design strategies and features are cost effectively incorporated before the active and mechanical systems are designed. Follow steps of design optimization, as applicable, including the following sequential approach:\n• Analyze potential sites and associated climate including local and regional context.\n• Select a sustainable site.\n• Design building to site analysis focusing on orientation, configuration and massing.\n• Select and integrate into the design, high performance and sustainable building envelope strategies and components (e.g. roofs, walls, fenestrations).\n• Select, design and integrate into the overall design, high performance and sustainable systems (e.g. HVAC, plumbing, water heating systems, lighting systems, control systems, elevators, and fire protection systems).  \n\nFor more detail on integrated design, see ASHRAE 189.1 Informative Appendix H (Integrated Design) and Section H1.1.1 (Charrette Process)"]
["ASHRAE Reference","ASHRAE 189.1, Informative Appendix H (Integrated Design) and Section H1.1.1"]
["1-200-02, 2-2.2 - Commissioning","For Air Force projects, the Project Delivery Team must determine the level of commissioning activities required. Commissioning should be conducted during pre-design and continue through post-occupancy.  Relevant systems include heating, ventilation, air conditioning, IAQ and refrigeration systems, building envelope systems, pressurization systems, lighting controls, irrigation, plumbing, domestic and process water pumping, domestic hot water systems, renewable energy systems, and energy and water measurement devices. Commissioning is to ensure that the designed systems function and operate according to the owner’s project requirements (OPR) and the basis of design (BOD) document (10.3.1.2). \n\nThe specific requirements include that procedures, documentation, tools, and training are provided to building operating staff to sustain systems, both during the commissioning an assembled into a systems manual\n\nPrior to building permit and completion of schematic design:\n(Schematic design can be the design charrette or similar conceptual design activity per the UFC)\n• The owner develops an OPR specifying goals, the design team updates the OPR with all parties.\n• The design team develops the BOD, including descriptions of building systems, IAQ criteria and design parameters, which is NOT required to include documentation of adherence to ANSI/ASHRAE Standard 55 according to the UFC.\n• The project designates a commissioning authority that reviews the OPR and BOD to avoid conflicts\n• Commissioning requirements are incorporated into project specifications and construction documents\n\n"]
[null,"Prior to building occupancy:\n• Commissioning authority verifies installation and performance of systems.\n• The preliminary commissioning report is completed and a system manual prepared with O&M documentation .\n• The commissioning authority should provide pre-functional checklists for the entity responsible for the installed equipment. These checklists ensure that equipment is installed correctly and operating according to design.\n\nPost-occupancy:\n• All planned commissioning activities completed for systems whose commissioning was not possible before\n• Final commission report completed and Systems manual delivered."]
["ASHRAE Reference","ASHRAE 189.1 Section 10.3.1.2"]
["UFC 1-200-02, 2-3. Promote Sustainable Location and Site Development"]
["1-200-02, 2-3.1 - Site Selection","During the site selection process, give preference to sites which possess the following characteristics when appropriate:\n\n• Adaptive reuse or renovation of buildings or sites (including historic buildings), or use of previously disturbed/developed areas\n• Building orientation to maximize energy efficiency, passive solar and daylighting potential of the building\n• Locations in central business districts (cantonment areas) and rural town centers (remote locations)\n• Sites well served by public or other transit if available or projected to be available\n• Site design elements that ensure safe and convenient pedestrian access\n• Proximity to housing\n• Avoiding development of sensitive land resources (including greenfields and USDA Prime Farmland as defined in 7 USC 4201)\n• Consult with local Cultural Resource Manager to identify potential impacts to existing historic buildings, districts, or view sheds\n• Parking management strategies to encourage co-use of shared parking\n"]
["ASHRAE Reference","Not provided"]
["1-200-02, 2-3.2 - Mitigation of Heat Island Effect","Hardscapes - ASHRAE 189.1 Section 5.3.2.1:\nAt least 50% of site hardscape consists of one or a combination of:\na. Existing vegetation or native/adapted plants that provide shade within 5 years \nb. Paving with minimum initial SRI of 29 or SRI of 35 for new concrete without added pigment.\nc. Shading through structures\nd. Parking under a building\ne. Not applicable under the UFC\n\nWalls – ASHRAE 189.1 Section 5.3.2.2:\nAt least 30% of the east and west above-grade walls are shaded to 20 ft, with plants, man-made structures/projections, existing buildings, hillsides, and/or renewable energy systems. Use native/adapted plants. OR if 75% of the opaque wall surfaces have a minimum SRI of 29. East wall shading is not required in climate zone 5, 6,7 and 8. West wall shading is not required in climate zone 7 and 8.\n\nAll shade coverage is estimated based on the arithmetic mean effective at 10 a.m., noon, and 3 p.m. at the summer solstice."]
["ASHRAE Reference","ASHRAE 189.1, Section 5.3.2.1; Section 5.3.2.2"]
["1-200-02, 2-3.3 - Reduction of Light Pollution","Meet the requirements of UFC 3-530-01. This document includes guidance on the design of interior, exterior lighting and controls. Sections 3-7 and 3-8 discuss light pollution and light trespass."]
["ASHRAE Reference","ASHRAE 189.1, Section 5.3.2.1; Section 5.3.2.2"]
["1-200-02, 2-3.4 - Stormwater Management","Meet the requirements of UFC 3-210-10. This document includes guidance for low impact development techniques and stormwater requirements under Section 438 of the Energy Indepedence and Security Act (EISA) 2007. The overall design objective for each applicable project is to maintain predevelopment hydrology and prevent any net increase in stormwater runoff."]
["ASHRAE Reference","ASHRAE 189.1, Section 5.3.2.1; Section 5.3.2.2"]
["HPSB II: Optimize Energy Performance (UFC 1-200-02, 2.4)"]
["1-200-02, 2-4.1 - Energy Efficiency","Design the building to achieve at least 30% energy consumption reduction from ASHRAE 90.1 baseline as required in 10 CFR Part 433. For Navy and Air Force projects, use ASHRAE 90.1 (2007) baseline, except for the performance rating formula in G1.2, which should be used as follows (from 10 CFR 433.5): \n\nPercentage improvement = 100 x (Baseline building consumption—Proposed building consumption) ÷(Baseline building consumption—Receptacle and process loads).\n\nThis differs from the LEED calculation.\nDesign Federal low-rise residential buildings to achieve at least 30% energy consumption reduction from International Energy Conservation Code (IECC) baseline as required in 10 CFR Part 435.\n\nIf a 30% reduction is not life-cycle cost-effective, the design of the proposed building shall be modified so as to achieve an energy consumption level at or better than the maximum level of energy efficiency that is life-cycle cost-effective."]
{"$rows_left_out":41}
{"sheet":"Guidance","index":2,"n_rows":134,"n_cols":2,"rows_kept":134,"cut":false,"hidden":false,"merged":[[0,0,0,1],[5,0,5,1],[4,0,4,1],[1,0,1,1],[2,0,2,1],[3,0,3,1]]}
["High Performance Sustainable Building Requirements, UFC 1-200-02, and LEED® 2009 References"]
["For more information on LEED® Credits that meet or align closely with federal requirements as well as other credits a building can pursue towards the Silver certification level, review the LEED® New Construction and Major Renovations 2009 Rating System"]
["Color Code"]
["LEED® Credits and/or Prerequisites that align closely with Federal High Performance Sustainable Buildings (HPSB) Requirements\nThese credits and/or prerequisites align closely with the associated HPSB Guiding Principle.  They could be either more or less stringent or have different measurement metrics.  In the case where one is more stringent than the other, achieving the more stringent one does not imply the less stringent is achieved."]
["LEED® Credits and/or Prerequisites that meet Federal High Performance Sustainable Buildings (HPSB) Requirements\nThese credits and/or prerequisites have the same requirements as the associated HPSB Guiding Principle. This does not guarantee achieving the LEED Credit, as some documentation methods may vary."]
["References"]
["EO 13423 High Performance Sustainable Building Guidance (Dec 08)"]
["LEED(R) for New Construction & Major Renovations 2009 - Nov 2008"]
[]
[null,"HPSB I: Employ Integrated Design Principles"]
[{"$f":"HYPERLINK(\"#\"&\"HPSBI.1\",\"Integrated Design\nHPSB I.1\nUFC 1-200-02 para 2-2.1\")","v":"Integrated Design\nHPSB I.1\nUFC 1-200-02 para 2-2.1"},"Use a collaborative, integrated planning and design team, composed of user, government support staff, and appropriate professionals, to identify requirements and to establish performance goals for siting, energy, water, materials, indoor environmental quality, and other comprehensive design goals.  Ensure incorporation of these goals throughout the design and lifecycle of the building, including deconstruction.\nSite attributes, including climate and local and regional context, impact the design of the building.  Evaluate the site and building components to determine whether passive and natural design strategies and features are cost effectively incorporated before the active and mechanical systems are designed.\n\nUse the following sequential approach:\n• Analyze potential sites and associated climate including local and regional context.\n• Select a sustainable site.\n• Design building to site analysis focusing on orientation, configuration and massing.\n• Select and integrate into the design, high performance and sustainable building envelope strategies and components (e.g. roofs, walls, fenestrations).\n• Select, design and integrate into the overall design, high performance and sustainable systems (e.g. HVAC, plumbing, water heating systems, lighting systems, control systems, elevators, and fire protection systems).  \n\nIncorporate integrated design as described in ASHRAE 189.1 Informative Appendix H (Integrated Design).  Follow the steps of design optimization, as applicable, in ASHRAE 189.1 Section H1.1.1 (Charrette Process)."]
["Requirement Source Document(s)","Executive Order 13423 and 13514"]
["LEED Credit(s) aligns closely with HPSB:","None"]
["LEED Credit(s) meet HPSB:","None"]
[{"$f":"HYPERLINK(\"#\"&\"HPSBI.2\",\"Commissioning\nHPSB I.2\nUFC 1-200-02 para 2-2.2\")","v":"Commissioning\nHPSB I.2\nUFC 1-200-02 para 2-2.2"},"Employ commissioning practices appropriate to the size and complexity of the building and its system components in order to verify performance and ensure that design requirements are met.  This must include an experienced commissioning provider.  The use of contracted services or Government personnel as the commissioning provider will be determined at project level.\n\nMeet the requirements of ASHRAE 189.1 Section 10.3.1.2 (Building Project Commissioning), with the following modifications:\n• For buildings and systems that are less complex, commissioning can be tailored as determined by the DoD Component AHJ . For Air Force projects, the Project Delivery Team must determine the level of commissioning activities required.\n• “Schematic design” is the design charrette or similar conceptual design activity.\n• Delete the requirement to meet ASHRAE 55 Section 6.2 (Documentation)."]
["Requirement Source Document(s)","Executive Order 13423 and 13514"]
[{"$f":"HYPERLINK(\"#\"&\"EAPR1\",\"LEED Credit(s) aligns closely with HPSB:\")","v":"LEED Credit(s) aligns closely with HPSB:"},"LEED EA Prerequisite 1: Fundamental Commissioning of Building Energy Systems\nLEED EA Credit 3: Enhanced Commissioning"]
["LEED Credit(s) meet HPSB:","None"]
[null,"UFC 1-200-02, 2-3. Promote Sustainable Location and Site Development"]
[{"$f":"HYPERLINK(\"#\"&\"UFC_231\",\"Site selection\nUFC 1-200-02 para 2-3.1\")","v":"Site selection\nUFC 1-200-02 para 2-3.1"},"Meet the requirements in UFC 2-100-01 and UFC 3-101-01.\n\nDuring the site selection process, give preference to sites which posses the following characteristics when appropriate:\n• Adaptive reuse or renovation of buildings or sites (including historic buildings), or use of previously disturbed/developed areas\n• Building orientation to maximize energy efficiency, passive solar and daylighting potential of the building\n• Locations in central business districts (cantonment areas) and rural town centers (remote locations)\n• Sites well served by public or other transit if available or projected to be available\n• Site design elements that ensure safe and convenient pedestrian access\n• Proximity to housing\n• Avoiding development of sensitive land resources (including greenfields and USDA Prime Farmland as defined in 7 USC 4201)\n• Consult with local Cultural Resource Manager to identify potential impacts to existing historic buildings, districts, or view sheds\n• Parking management strategies to encourage co-use of shared parking"]
{"$rows_left_out":115}
{"sheet":"LocationList","index":3,"n_rows":211,"n_cols":6,"rows_kept":211,"cut":false,"hidden":true,"merged":[]}
[null,"****FOUO******"]
[null,"BASE Selections:"]
[null,"BASE NAME","CITY","STATE","CONUS"]
[87,"Other","Other","Other","Other"]
[69,"Altus AFB","Altus","OK","Yes"]
[4,"Andersen AFB","Agana","Guam","No"]
[52,"Andrews AFB","Camp Springs","MD","Yes"]
[75,"Arnold AFB","Manchester","TN","Yes"]
[5,"Aviano AB","Pordenone","Italy","No"]
[50,"Barksdale AFB","Bossier City","LA","Yes"]
[28,"Beale AFB","Yuba City","CA","Yes"]
[21,"Bellows AFB","Honolulu","HI","Yes"]
[37,"Bolling AFB","Washington DC","DC","Yes"]
[33,"Buckley AFB","Denver","CO","Yes"]
[64,"Cannon AFB","Clovis","NM","Yes"]
[43,"Cape Canaveral AFS","Cape Canaveral","FL","Yes"]
[72,"Charleston AFB","Charleston","SC","Yes"]
[34,"Cheyenne Mountain AFS","Colorado Springs","CO","Yes"]
[54,"Columbus AFB","Columbus","MS","Yes"]
[65,"Creech AFB","Indian Springs","NV","Yes"]
{"$rows_left_out":192}
{"sheet":"Color Legend","index":4,"n_rows":11,"n_cols":2,"rows_kept":11,"cut":false,"hidden":false,"merged":[[0,0,0,1],[5,0,8,0]]}
["AF MILCON Sustainable Building Requirements Legend"]
["Green text","LEED® Credits and/or Prerequisites that align closely with Federal High Performance Sustainable Buildings (HPSB) Requirements\nThese credits and/or prerequisites align closely with the associated HPSB Guiding Principle.  They could be either more or less stringent or have different measurement metrics.  In the case where one is more stringent than the other, achieving the more stringent one does not imply the less stringent is achieved."]
["Blue Text","LEED® Credits and/or Prerequisites that meet Federal High Performance Sustainable Buildings (HPSB) Requirements\nThese credits and/or prerequisites have the same requirements as the associated HPSB Guiding Principle. This does not guarantee achieving the LEED Credit, as some documentation methods may vary."]
["Gray Text","Recommended (Federal Requirement not fully defined at this time)"]
["Light Gray Cell","Cell is populated by other cells. User is not required to enter values."]
["Light Green Cell (When used, conditional formatting changes  cell to Green, Yellow, or Red depending on entry)","Cell provides a drop-down box for the user to select which LEED Credits and HPSB Requirements that the project is attempting.  When a \"Yes\", \"Maybe\", or \"No\" is selected the cell follows the stoplight convention to visually represent progress. The stoplight convention is also used for \"Yes\", \"Maybe\" or \"No\" totals.  Some light green boxes also have an option for \"N/A\" when used for subquestions"]
[null,"Cell uses a drop down box and user is designating \"Yes\" or \"N/A\" when applicable"]
[null,"Cell uses a drop down box and user is designating \"Maybe\" "]
[null,"Cell uses a drop down box and user is designating \"No\" "]
["Dark Blue Cell, White Text","LEED® Credits that meet USAF Energy & Water Criteria (may depend on technologies & strategies). The DoD Sustainable Buildings Policy and AF Sustainable Design and Development Memorandum require a minimum of 20 energy and water credits for all projects seeking LEED certification. SS Credits 7.1-7.2, WE Credits 1.1 - 3, EA Credits 1-3 and Credits 5-6, IEQ Credit 1 and Credit 8.1 are always energy and water projects according to AF policy. SS Credit 8 is an energy and water credit if the project uses Option 1 for Indoor Lighting.  Innovation and Design and Regional Priority Credits must be specified as energy and water projects for inclusion."]
["Light Yellow Cell","Cell is for custom entry on how the project is pursuing LEED Credits and HPSB requirements. These are subquestions and also general information questions. Boxes that appear when cell is selected give further instruction on entering data.  Some cells restrict values that can be entered - which is explained if incorrectly entered"]

{"sheet":"Dropdowns","index":5,"n_rows":49,"n_cols":2,"rows_kept":49,"cut":false,"hidden":true,"merged":[]}
[]
[]
[]
[]
[]
[]
[]
[]
[]
[]
[]
[]
[]
[]
[]
[]
[]
[]
[]
[]
{"$rows_left_out":30}
{"sheet":"NA_Justification","index":6,"n_rows":38,"n_cols":5,"rows_kept":38,"cut":false,"hidden":false,"merged":[]}
["Federal Requirements for High Performance and Sustainable Buildings (HPSB) & UFC 1-200-02"]
["Instructions: Provide a common or project specific justification for an element to be non-applicable, when completed, the Scoresheet tab will allow an N/A response."]
["Justification for Non-Applicable Answers",null,"Common Justification","Project Specific Justification","Complete?"]
["HPSB I: Employ Integrated Design Principles (UFC 1-200-02, 2-2)"]
["HPSB I.1",{"$f":"HYPERLINK(\"#\"&\"HPSBI.1_Ref\",\"Integrated Design\")","v":"Integrated Design"},null,null,{"$f":"IF(Scoresheet!A51=\"N/A\",IF(COUNTBLANK(C5:D5)<2,\"Yes\",\"No\"),\"Applicable\")","v":"Applicable"}]
["HPSB I.2",{"$f":"HYPERLINK(\"#\"&\"HPSBI.2_Ref\",\"Commissioning\")","v":"Commissioning"},null,null,{"$f":"IF(Scoresheet!A52=\"N/A\",IF(COUNTBLANK(C6:D6)<2,\"Yes\",\"No\"),\"Applicable\")","v":"Applicable"}]
["UFC 1-200-02, 2-3. Promote Sustainable Location and Site Development"]
["UFC 2-3.1",{"$f":"HYPERLINK(\"#\"&\"UFC_231_Ref\",\"Site selection\")","v":"Site selection"},null,null,{"$f":"IF(Scoresheet!A55=\"N/A\",IF(COUNTBLANK(C8:D8)<2,\"Yes\",\"No\"),\"Applicable\")","v":"Applicable"}]
["UFC 2-3.2",{"$f":"HYPERLINK(\"#\"&\"UFC_232_Ref\",\"Mitigation of Heat Island Effect\")","v":"Mitigation of Heat Island Effect"},null,null,{"$f":"IF(Scoresheet!A56=\"N/A\",IF(COUNTBLANK(C9:D9)<2,\"Yes\",\"No\"),\"Applicable\")","v":"Applicable"}]
["UFC 2-3.3",{"$f":"HYPERLINK(\"#\"&\"UFC_233_Ref\",\"Reduction of Light Pollution\")","v":"Reduction of Light Pollution"},null,null,{"$f":"IF(Scoresheet!A57=\"N/A\",IF(COUNTBLANK(C10:D10)<2,\"Yes\",\"No\"),\"Applicable\")","v":"Applicable"}]
["HPSB III.3-4",{"$f":"HYPERLINK(\"#\"&\"HPSBIII.3_Ref\",\"Stormwater Management\")","v":"Stormwater Management"},null,null,{"$f":"IF(Scoresheet!A58=\"N/A\",IF(COUNTBLANK(C11:D11)<2,\"Yes\",\"No\"),\"Applicable\")","v":"Applicable"}]
["HPSB II: Optimize Energy Performance (UFC 1-200-02, 2-4)"]
["HPSB II.1","Energy Efficiency",null,null,{"$f":"IF(Scoresheet!A61=\"N/A\",IF(COUNTBLANK(C13:D13)<2,\"Yes\",\"No\"),\"Applicable\")","v":"Applicable"}]
["HPSB II.2",{"$f":"HYPERLINK(\"#\"&\"HPSBII.3_Ref\",\"On-site Renewable Energy - Solar Hot Water Heater System\")","v":"On-site Renewable Energy - Solar Hot Water Heater System"},null,null,{"$f":"IF(Scoresheet!A71=\"N/A\",IF(COUNTBLANK(C14:D14)<2,\"Yes\",\"No\"),\"Applicable\")","v":"Applicable"}]
["HPSB II.3",{"$f":"HYPERLINK(\"#\"&\"HPSBII.4_Ref\",\"On-site Renewable Energy\")","v":"On-site Renewable Energy"},null,null,{"$f":"IF(Scoresheet!A75=\"N/A\",IF(COUNTBLANK(C15:D15)<2,\"Yes\",\"No\"),\"Applicable\")","v":"Applicable"}]
["HPSB II.4",{"$f":"HYPERLINK(\"#\"&\"HPSBII.5_Ref\",\"Measurement and Verification\")","v":"Measurement and Verification"}]
[null,"Water Metering: Select N/A if no service",null,null,{"$f":"IF(Scoresheet!D91=\"N/A\",IF(COUNTBLANK(C17:D17)<2,\"Yes\",\"No\"),\"Applicable\")","v":"Applicable"}]
[null,"Electric Metering: Select N/A if no service",null,null,{"$f":"IF(Scoresheet!D92=\"N/A\",IF(COUNTBLANK(C18:D18)<2,\"Yes\",\"No\"),\"Applicable\")","v":"Applicable"}]
[null,"Natural Gas Metering: Select N/A if no service",null,null,{"$f":"IF(Scoresheet!D93=\"N/A\",IF(COUNTBLANK(C19:D19)<2,\"Yes\",\"No\"),\"Applicable\")","v":"Applicable"}]
[null,"Steam Metering: Select N/A if no service",null,null,{"$f":"IF(Scoresheet!D94=\"N/A\",IF(COUNTBLANK(C20:D20)<2,\"Yes\",\"No\"),\"Applicable\")","v":"Applicable"}]
{"$rows_left_out":18}